0 votes

While trying to compile for Android (on ubuntu Linux 16.04 64-bit) I got an error:

Incremental java compilation is an incubating feature. :preBuild
UP-TO-DATE :preDebugBuild UP-TO-DATE :checkDebugManifest
:preReleaseBuild UP-TO-DATE
:prepareComAndroidSupportSupportV42340Library UP-TO-DATE
:prepareDebugDependencies :compileDebugAidl FAILED

FAILURE: Build failed with an exception.

  • What went wrong: Execution failed for task ':compileDebugAidl'.

    java.lang.RuntimeException: org.gradle.process.internal.ExecException: A problem occurred starting
    process 'command
    '/home/user1/Android/android-sdk-linux/build-tools/23.0.3/aidl''

  • Try: Run with --stacktrace option to get the stack trace. Run with --info or --debug option to get more log output.

BUILD FAILED

in Engine by (715 points)

1 Answer

+1 vote

Additional files that docs not mention need to be installed:
lib32z1 lib32ncurses5 lib32stdc++6
sudo apt-get install lib32z1 lib32ncurses5 lib32stdc++6

For Fedora it probably should be zlib.i686 ncurses-libs.i686 bzip2-libs.i686

by (715 points)
Welcome to Godot Engine Q&A, where you can ask questions and receive answers from other members of the community.

Please make sure to read How to use this Q&A? before posting your first questions.
Social login is currently unavailable. If you've previously logged in with a Facebook or GitHub account, use the I forgot my password link in the login box to set a password for your account. If you still can't access your account, send an email to webmaster@godotengine.org with your username.