0 votes

anyone familiar with this error? i'm compiling godot for an android module.

[Initial build] Compiling ==> scene/register_scene_types.cpp scene/register_scene_types.cpp:545:15: error: no member named 'initialize_dynamic_fonts' in 'DynamicFont' DynamicFont::initialize_dynamic_fonts(); ~~~~~~~~~~~~~^ scene/register_scene_types.cpp:626:15: error: no member named 'finish_dynamic_fonts' in 'DynamicFont' DynamicFont::finish_dynamic_fonts(); ~~~~~~~~~~~~~^ 2 errors generated. scons: *** [scene/register_scene_types.android.opt.armv7.neon.o] Error 1 scons: building terminated because of errors.

in Engine by (18 points)

Please log in or register to answer this question.

Welcome to Godot Engine Q&A, where you can ask questions and receive answers from other members of the community.

Please make sure to read How to use this Q&A? before posting your first questions.
Social login is currently unavailable. If you've previously logged in with a Facebook or GitHub account, use the I forgot my password link in the login box to set a password for your account. If you still can't access your account, send an email to webmaster@godotengine.org with your username.